Reaction Details
TargetPeroxisome proliferator-activated receptor delta
LigandBDBM29879
Substrate/CompetitorBDBM28662
Meas. Tech.Scintillation Proximity Assay (Ki) and Cell-Based Transcription Assay (EC50)
Ki 5±n/a nM
EC50 44±n/a nM
Citation Connors, RVWang, ZHarrison, MZhang, AWanska, MHiscock, SFox, BDore, MLabelle, MSudom, AJohnstone, SLiu, JWalker, NPChai, ASiegler, KLi, YCoward, P Identification of a PPARdelta agonist with partial agonistic activity on PPARgamma. Bioorg Med Chem Lett19:3550-4 (2009) 
 
Peroxisome proliferator-activated receptor delta
Name:Peroxisome proliferator-activated receptor delta
Type:Enzyme
Mol. Mass.:49910.45
Organism:Homo sapiens (Human)
Description:Q03181
Residue:441
BDBM29879
BDBM28662
NameBDBM29879
Synonyms:alkynyl ether, 21
TypeSmall organic molecule
Emp. Form.C31H29F3O5S
Mol. Mass.570.619
SMILESCCC#CCOc1cc(COc2ccc(cc2)C(F)(F)F)ccc1Sc1ccc(OCC(O)=O)c2CCCCc12