Reaction Details
TargetPeroxisome proliferator-activated receptor gamma
LigandBDBM29889
Substrate/Competitor[3H]rosiglitazone
Meas. Tech.Scintillation Proximity Assay (Ki) and Cell-Based Transcription Assay (EC50)
Ki 39±n/a nM
EC50 560±n/a nM
Citation Connors, RVWang, ZHarrison, MZhang, AWanska, MHiscock, SFox, BDore, MLabelle, MSudom, AJohnstone, SLiu, JWalker, NPChai, ASiegler, KLi, YCoward, P Identification of a PPARdelta agonist with partial agonistic activity on PPARgamma. Bioorg Med Chem Lett19:3550-4 (2009) 
 
Peroxisome proliferator-activated receptor gamma
Name:Peroxisome proliferator-activated receptor gamma
Type:Nuclear Receptor
Mol. Mass.:57613.46
Organism:Homo sapiens (Human)
Description:P37231
Residue:505
BDBM29889
[3H]rosiglitazone
NameBDBM29889
Synonyms:alkynyl ether, 31
TypeSmall organic molecule
Emp. Form.C30H29ClO5S
Mol. Mass.537.066
SMILESCCC#CCOc1cc(COc2ccc(Cl)cc2)ccc1Sc1ccc(OCC(O)=O)c2CCCCc12