Reaction Details
TargetMitogen-activated protein kinase kinase kinase kinase 1
LigandBDBM283463
Substrate/Competitorn/a
Meas. Tech.In Vitro Enzyme Inhibition
IC50<100±n/a nM
Citation McDonald, AQian, S Therapeutic inhibitory compounds US Patent US10308637 Publication Date 6/4/2019
 
Mitogen-activated protein kinase kinase kinase kinase 1
Name:Mitogen-activated protein kinase kinase kinase kinase 1
Type:PROTEIN
Mol. Mass.:91316.07
Organism:Homo sapiens (Human)
Description:ChEMBL_586597
Residue:833
BDBM283463
NameBDBM283463
Synonyms:N-((1-aminoisoquinolin-6-yl)methyl)-2-((6- methylquinolin-3-yl)methyl)isonicotinamide US10266515, Example 115 US11021463, Example 115 | US9611252, Example 115
TypeSmall organic molecule
Emp. Form.C27H23N5O
Mol. Mass.433.5044
SMILESCc1ccc2ncc(Cc3cc(ccn3)C(=O)NCc3ccc4c(N)nccc4c3)cc2c1