Reaction Details
TargetcAMP-specific 3',5'-cyclic phosphodiesterase 4D
LigandBDBM31640
Substrate/CompetitorBDBM10851
Meas. Tech.Enzyme Inhibition Assay
pH7.5±n/a
Temperature296.15±n/a K
IC50>2512±n/a nM
Citation Kranz, MWall, MEvans, BMiah, ABallantine, SDelves, CDombroski, BGross, JSchneck, JVilla, JPNeu, MSomers, DO Identification of PDE4B Over 4D subtype-selective inhibitors revealing an unprecedented binding mode. Bioorg Med Chem17:5336-41 (2009) 
 
cAMP-specific 3',5'-cyclic phosphodiesterase 4D
Name:cAMP-specific 3',5'-cyclic phosphodiesterase 4D
Type:Protein
Mol. Mass.:91092.69
Organism:Homo sapiens (Human)
Description:Q08499
Residue:809
BDBM31640
BDBM10851
NameBDBM31640
Synonyms:tetrahydrobenzothiophene (THBT), 14
TypeSmall organic molecule
Emp. Form.C17H17N3O4S
Mol. Mass.359.4
SMILESCC1CCc2c(C1)sc(NC(=O)c1cccc(c1)[N+]([O-])=O)c2C(N)=O