Reaction Details
TargetKynurenine--oxoglutarate transaminase 1
LigandBDBM31881
Substrate/CompetitorBDBM31880
Meas. Tech.hKAT-I Activity Assay
pH7.5±n/a
Temperature311.15±n/a K
IC50 220000±220000 nM
Citation Han, QRobinson, HCai, TTagle, DALi, J Structural insight into the inhibition of human kynurenine aminotransferase I/glutamine transaminase K. J Med Chem52:2786-93 (2009) 
 
Kynurenine--oxoglutarate transaminase 1
Name:Kynurenine--oxoglutarate transaminase 1
Type:Aminotransferase; Lyase
Mol. Mass.:47874.00
Organism:Homo sapiens (Human)
Description:Recombinant hKAT-1 was expressed and purified from Sf9 insect cells.
Residue:422
BDBM31881
BDBM31880
NameBDBM31881
Synonyms:DL-indole-3-lactic acid
TypeSmall organic molecule
Emp. Form.C11H11NO3
Mol. Mass.205.2099
SMILESOC(Cc1c[nH]c2ccccc12)C(O)=O