Reaction Details
Target3-hydroxyacyl-[acyl-carrier-protein] dehydratase FabZ
LigandBDBM31925
Substrate/CompetitorBDBM8737
Meas. Tech.Enzymatic Inhibition Assay
pH8±n/a
Temperature298.15±n/a K
IC50 6430±1360 nM
Comments85% inhibition @ 50 uM.
Citation He, LZhang, LLiu, XLi, XZheng, MLi, HYu, KChen, KShen, XJiang, HLiu, H Discovering potent inhibitors against the beta-hydroxyacyl-acyl carrier protein dehydratase (FabZ) of Helicobacter pylori: structure-based design, synthesis, bioassay, and crystal structure determination. J Med Chem52:2465-81 (2009) 
 
3-hydroxyacyl-[acyl-carrier-protein] dehydratase FabZ
Name:3-hydroxyacyl-[acyl-carrier-protein] dehydratase FabZ
Type:Lyase
Mol. Mass.:18198.05
Organism:Helicobacter pylori (Campylobacter pylori)
Description:HpfabZ is expressed and purified from E. coli.
Residue:159
BDBM31925
BDBM8737
NameBDBM31925
Synonyms:carbohydrazide derivative, 3h
TypeSmall organic molecule
Emp. Form.C14H9Br2FN2O3
Mol. Mass.432.039
SMILESOc1c(Br)cc(\C=N\NC(=O)c2ccc(F)cc2)c(O)c1Br