Reaction Details
Target3-hydroxyacyl-[acyl-carrier-protein] dehydratase FabZ
LigandBDBM31926
Substrate/CompetitorBDBM8737
Meas. Tech.Enzymatic Inhibition Assay
pH8±n/a
Temperature298.15±n/a K
IC50 1520±190 nM
Comments93.8% inhibition @ 50 uM.
Citation He, LZhang, LLiu, XLi, XZheng, MLi, HYu, KChen, KShen, XJiang, HLiu, H Discovering potent inhibitors against the beta-hydroxyacyl-acyl carrier protein dehydratase (FabZ) of Helicobacter pylori: structure-based design, synthesis, bioassay, and crystal structure determination. J Med Chem52:2465-81 (2009) 
 
3-hydroxyacyl-[acyl-carrier-protein] dehydratase FabZ
Name:3-hydroxyacyl-[acyl-carrier-protein] dehydratase FabZ
Type:Lyase
Mol. Mass.:18198.05
Organism:Helicobacter pylori (Campylobacter pylori)
Description:HpfabZ is expressed and purified from E. coli.
Residue:159
BDBM31926
BDBM8737
NameBDBM31926
Synonyms:carbohydrazide derivative, 3i
TypeSmall organic molecule
Emp. Form.C14H9Br2ClN2O3
Mol. Mass.448.494
SMILESOc1c(Br)cc(\C=N\NC(=O)c2ccc(Cl)cc2)c(O)c1Br