Reaction Details
Target3-hydroxyacyl-[acyl-carrier-protein] dehydratase FabZ
LigandBDBM31934
Substrate/CompetitorBDBM8737
Meas. Tech.Enzymatic Inhibition Assay
pH8±n/a
Temperature298.15±n/a K
IC50 1520±110 nM
Comments74.4% inhibition @ 50 uM.
Citation He, LZhang, LLiu, XLi, XZheng, MLi, HYu, KChen, KShen, XJiang, HLiu, H Discovering potent inhibitors against the beta-hydroxyacyl-acyl carrier protein dehydratase (FabZ) of Helicobacter pylori: structure-based design, synthesis, bioassay, and crystal structure determination. J Med Chem52:2465-81 (2009) 
 
3-hydroxyacyl-[acyl-carrier-protein] dehydratase FabZ
Name:3-hydroxyacyl-[acyl-carrier-protein] dehydratase FabZ
Type:Lyase
Mol. Mass.:18198.05
Organism:Helicobacter pylori (Campylobacter pylori)
Description:HpfabZ is expressed and purified from E. coli.
Residue:159
BDBM31934
BDBM8737
NameBDBM31934
Synonyms:carbohydrazide derivative, 3q
TypeSmall organic molecule
Emp. Form.C18H18Br2N2O3
Mol. Mass.470.155
SMILESCC(C)(C)c1ccc(cc1)C(=O)N\N=C\c1cc(Br)c(O)c(Br)c1O