Reaction Details
Target3-hydroxyacyl-[acyl-carrier-protein] dehydratase FabZ
LigandBDBM31959
Substrate/CompetitorBDBM8737
Meas. Tech.Enzymatic Inhibition Assay
IC50 42700±n/a nM
Citation He, LZhang, LLiu, XLi, XZheng, MLi, HYu, KChen, KShen, XJiang, HLiu, H Discovering potent inhibitors against the beta-hydroxyacyl-acyl carrier protein dehydratase (FabZ) of Helicobacter pylori: structure-based design, synthesis, bioassay, and crystal structure determination. J Med Chem52:2465-81 (2009) 
 
3-hydroxyacyl-[acyl-carrier-protein] dehydratase FabZ
Name:3-hydroxyacyl-[acyl-carrier-protein] dehydratase FabZ
Type:Lyase
Mol. Mass.:18198.05
Organism:Helicobacter pylori (Campylobacter pylori)
Description:HpfabZ is expressed and purified from E. coli.
Residue:159
BDBM31959
BDBM8737
NameBDBM31959
Synonyms:carbohydrazide derivative, 5b
TypeSmall organic molecule
Emp. Form.C20H14Br2N2O4
Mol. Mass.506.144
SMILESOc1ccc(cc1)-c1ccc(cc1)C(=O)NN=Cc1cc(Br)c(O)c(Br)c1O