Reaction Details
Target3-hydroxyacyl-[acyl-carrier-protein] dehydratase FabZ
LigandBDBM31964
Substrate/CompetitorBDBM8737
Meas. Tech.Enzymatic Inhibition Assay
IC50 1970±n/a nM
Citation He, LZhang, LLiu, XLi, XZheng, MLi, HYu, KChen, KShen, XJiang, HLiu, H Discovering potent inhibitors against the beta-hydroxyacyl-acyl carrier protein dehydratase (FabZ) of Helicobacter pylori: structure-based design, synthesis, bioassay, and crystal structure determination. J Med Chem52:2465-81 (2009) 
 
3-hydroxyacyl-[acyl-carrier-protein] dehydratase FabZ
Name:3-hydroxyacyl-[acyl-carrier-protein] dehydratase FabZ
Type:Lyase
Mol. Mass.:18198.05
Organism:Helicobacter pylori (Campylobacter pylori)
Description:HpfabZ is expressed and purified from E. coli.
Residue:159
BDBM31964
BDBM8737
NameBDBM31964
Synonyms:carbohydrazide derivative, 5g
TypeSmall organic molecule
Emp. Form.C18H12Br2N2O4
Mol. Mass.480.107
SMILESOc1c(Br)cc(C=NNC(=O)c2ccc3ccccc3c2O)c(O)c1Br