Reaction Details
Target3-hydroxyacyl-[acyl-carrier-protein] dehydratase FabZ
LigandBDBM31967
Substrate/CompetitorBDBM8737
Meas. Tech.Enzymatic Inhibition Assay
IC50 3550±n/a nM
Citation He, LZhang, LLiu, XLi, XZheng, MLi, HYu, KChen, KShen, XJiang, HLiu, H Discovering potent inhibitors against the beta-hydroxyacyl-acyl carrier protein dehydratase (FabZ) of Helicobacter pylori: structure-based design, synthesis, bioassay, and crystal structure determination. J Med Chem52:2465-81 (2009) 
 
3-hydroxyacyl-[acyl-carrier-protein] dehydratase FabZ
Name:3-hydroxyacyl-[acyl-carrier-protein] dehydratase FabZ
Type:Lyase
Mol. Mass.:18198.05
Organism:Helicobacter pylori (Campylobacter pylori)
Description:HpfabZ is expressed and purified from E. coli.
Residue:159
BDBM31967
BDBM8737
NameBDBM31967
Synonyms:carbohydrazide derivative, 5j
TypeSmall organic molecule
Emp. Form.C18H11Br3N2O3
Mol. Mass.543.004
SMILESOc1c(Br)cc(C=NNC(=O)c2ccc3cc(Br)ccc3c2)c(O)c1Br