Reaction Details
TargetGenome polyprotein [1066-1250,R1182K]/[1394-1440,K1405R,D1408E]
LigandBDBM33256
Substrate/CompetitorBDBM33248
Meas. Tech.Enzyme Inhibition Assay (IC50) and Fluorescence Quench Assay (KD)
pH7.5±n/a
Temperature310.15±n/a K
IC50 1600±800 nM
CommentsHill slope=3.2.
Citation Bodenreider, CBeer, DKeller, THSonntag, SWen, DYap, LYau, YHShochat, SGHuang, DZhou, TCaflisch, ASu, XCOzawa, KOtting, GVasudevan, SGLescar, JLim, SP A fluorescence quenching assay to discriminate between specific and nonspecific inhibitors of dengue virus protease. Anal Biochem395:195-204 (2009) 
 
Genome polyprotein [1066-1250,R1182K]/[1394-1440,K1405R,D1408E]
Name:Genome polyprotein [1066-1250,R1182K]/[1394-1440,K1405R,D1408E]
Type:Cofactor/Enzyme
Mol. Mass.:n/a
Description:n/a
Components:This complex has 2 components.
Component 1
Name:Genome polyprotein [1394-1440,K1405R,D1408E]
Synonyms:Flavivirus non-structural protein NS2B POLG_DEN2N
Type:Cofactor Domain
Mol. Mass.:5197.48
Organism:Dengue virus 2 (strain TSV01)
Description:P14340[1394-1440,K1405R,D1408E]
Residue:47
adleler aadvrweeqa eisgsspils itisedgsms ikneeeeqtl
Component 2
Name:Genome polyprotein [1066-1250,R1182K]
Synonyms:Flavivirus NS3 serine protease POLG_DEN2T
Type:Catalytic Domain
Mol. Mass.:19925.90
Organism:Dengue virus 2 (strain TSV01)
Description:n/a
Residue:185
BDBM33256
BDBM33248
NameBDBM33256
Synonyms:phthalazine-based compound, 7
TypeSmall organic molecule
Emp. Form.C31H26N6O2
Mol. Mass.514.5771
SMILESCOC(=O)c1ccc(cc1)-c1ccc(Nc2nnc(Nc3ccc(cc3)C3=NCCN3)c3ccccc23)cc1