Reaction Details
TargetCarbonic anhydrase 3
LigandBDBM33279
Substrate/CompetitorBDBM10856
Meas. Tech.CA Inhibition Assay
pH7.5±n/a
Temperature296.15±n/a K
Ki 9100±n/a nM
Citation Vitale, RMAlterio, VInnocenti, AWinum, JYMonti, SMDe Simone, GSupuran, CT Carbonic anhydrase inhibitors. Comparison of aliphatic sulfamate/bis-sulfamate adducts with isozymes II and IX as a platform for designing tight-binding, more isoform-selective inhibitors. J Med Chem52:5990-8 (2009) 
 
Carbonic anhydrase 3
Name:Carbonic anhydrase 3
Type:Enzyme
Mol. Mass.:29562.11
Organism:Homo sapiens (Human)
Description:Human cloned isozyme.
Residue:260
BDBM33279
BDBM10856
NameBDBM33279
Synonyms:CHEMBL24261 | aliphatic sulfamate, 1
TypeSmall organic molecule
Emp. Form.C8H19NO3S
Mol. Mass.209.306
SMILESCCCCCCCCOS(N)(=O)=O