Reaction Details
TargetBifunctional dihydrofolate reductase-thymidylate synthase
LigandBDBM33395
Substrate/CompetitorBDBM18044
IC50 3940±n/a nM
Citation Gangjee, ALi, WLin, LZeng, YIhnat, MWarnke, LAGreen, DWCody, VPace, JQueener, SF Design, synthesis, and X-ray crystal structures of 2,4-diaminofuro[2,3-d]pyrimidines as multireceptor tyrosine kinase and dihydrofolate reductase inhibitors. Bioorg Med Chem17:7324-36 (2009) 
 
Bifunctional dihydrofolate reductase-thymidylate synthase
Name:Bifunctional dihydrofolate reductase-thymidylate synthase
Type:Enzyme
Mol. Mass.:68757.49
Organism:Toxoplasma gondii
Description:Q07422
Residue:610
BDBM33395
BDBM18044
NameBDBM33395
Synonyms:2,4-diaminofuro[2,3-d]pyrimidine, 1b | Z-isomer
TypeSmall organic molecule
Emp. Form.C16H16N4O2
Mol. Mass.296.3238
SMILESCOc1ccccc1\C(C)=C/c1coc2nc(N)nc(N)c12