Reaction Details
TargetHexokinase-4
LigandBDBM34071
Substrate/CompetitorBDBM34103
Meas. Tech.Glycogen Phosphorylase Enzyme Assay
EC50 67.11±n/a nM
Citation Zhang, LLi, HZhu, QLiu, JChen, LLeng, YJiang, HLiu, H Benzamide derivatives as dual-action hypoglycemic agents that inhibit glycogen phosphorylase and activate glucokinase. Bioorg Med Chem17:7301-12 (2009) 
 
Hexokinase-4
Name:Hexokinase-4
Type:Enzyme
Mol. Mass.:52175.81
Organism:Homo sapiens (Human)
Description:P35557
Residue:465
BDBM34071
BDBM34103
NameBDBM34071
Synonyms:benzamide derivative, 6
TypeSmall organic molecule
Emp. Form.C14H12FN5OS2
Mol. Mass.349.406
SMILESCn1ccnc1Sc1cc(C(=O)Nc2nccs2)c(N)cc1F