Reaction Details
TargetCannabinoid receptor 1
LigandBDBM35869
Substrate/CompetitorBDBM35866
Meas. Tech.GTP-gamma-S Binding Assay
pH7.4±n/a
Temperature303.15±n/a K
IC50 766±n/a nM
Citation Boström, JBerggren, KElebring, TGreasley, PJWilstermann, M Scaffold hopping, synthesis and structure-activity relationships of 5,6-diaryl-pyrazine-2-amide derivatives: a novel series of CB1 receptor antagonists. Bioorg Med Chem15:4077-84 (2007) 
 
Cannabinoid receptor 1
Name:Cannabinoid receptor 1
Type:G Protein-Coupled Receptor (GPCR)
Mol. Mass.:52868.96
Organism:Homo sapiens (Human)
Description:P21554
Residue:472
BDBM35869
BDBM35866
NameBDBM35869
Synonyms:5,6-diaryl-pyrazine-2-amide derivative, 5a 5,6-diphenyl-pyrazine-2-carboxylic acid piperidin-1-ylamide | CHEMBL389883
TypeSmall organic molecule
Emp. Form.C22H22N4O
Mol. Mass.358.4363
SMILESO=C(NN1CCCCC1)c1cnc(-c2ccccc2)c(n1)-c1ccccc1