Reaction Details
TargetCannabinoid receptor 1
LigandBDBM35870
Substrate/CompetitorBDBM35866
Meas. Tech.GTP-gamma-S Binding Assay
pH7.4±n/a
Temperature303.15±n/a K
IC50 1±n/a nM
Citation Boström, JBerggren, KElebring, TGreasley, PJWilstermann, M Scaffold hopping, synthesis and structure-activity relationships of 5,6-diaryl-pyrazine-2-amide derivatives: a novel series of CB1 receptor antagonists. Bioorg Med Chem15:4077-84 (2007) 
 
Cannabinoid receptor 1
Name:Cannabinoid receptor 1
Type:G Protein-Coupled Receptor (GPCR)
Mol. Mass.:52868.96
Organism:Homo sapiens (Human)
Description:P21554
Residue:472
BDBM35870
BDBM35866
NameBDBM35870
Synonyms:5,6-bis-(4-bromo-phenyl)-pyrazine-2-carboxylicacid piperidin-1-ylamide CHEMBL226222
TypeSmall organic molecule
Emp. Form.C22H20Br2N4O
Mol. Mass.516.228
SMILESBrc1ccc(cc1)-c1ncc(nc1-c1ccc(Br)cc1)C(=O)NN1CCCCC1