Reaction Details
TargetCathepsin B
LigandBDBM36328
Substrate/CompetitorBDBM36388
Meas. Tech.Assay name: Protease Inhibition Assay
pH5.5±0
Temperature310.15±0 K
IC50 15±n/a nM
Citation Kato, DBoatright, KMBerger, ABNazif, TBlum, GRyan, CChehade, KASalvesen, GSBogyo, M Activity-based probes that target diverse cysteine protease families. Nat Chem Biol1:33-8 (2005) 
 
Cathepsin B
Name:Cathepsin B
Type:Protein
Mol. Mass.:37463.53
Organism:Rattus norvegicus
Description:P00787
Residue:339
BDBM36328
BDBM36388
NameBDBM36328
Synonyms:Z-FR-AMOK 9b
TypeSmall organic molecule
Emp. Form.C33H39N5O6
Mol. Mass.601.6927
SMILES[#6]-c1cccc(-[#6])c1-[#6](=O)-[#8]-[#6]-[#6](=O)-[#6@H](-[#6]-[#6]-[#6]\[#7]=[#6](/[#7])-[#7])-[#7]-[#6](=O)-[#6@H](-[#6]-c1ccccc1)-[#7]-[#6](=O)-[#8]-[#6]-c1ccccc1