Reaction Details
TargetNitric oxide synthase, inducible
LigandBDBM50148162
Substrate/Competitorn/a
Meas. Tech.NOS Enzyme Inhibition Assay
pH7±0
Temperature310.15±0 K
IC50 3.5e+2±n/a nM
Citation Garcin, EDArvai, ASRosenfeld, RJKroeger, MDCrane, BRAndersson, GAndrews, GHamley, PJMallinder, PRNicholls, DJSt-Gallay, SATinker, ACGensmantel, NPMete, ACheshire, DRConnolly, SStuehr, DJAberg, AWallace, AVTainer, JAGetzoff, ED Anchored plasticity opens doors for selective inhibitor design in nitric oxide synthase. Nat Chem Biol4:700-7 (2008) 
 
Nitric oxide synthase, inducible
Name:Nitric oxide synthase, inducible
Type:Homodimer
Mol. Mass.:131141.95
Organism:Homo sapiens (Human)
Description:P35228
Residue:1153
BDBM50148162
NameBDBM50148162
Synonyms:4-(4-Methyl-pyridin-2-ylamino)-piperidine-1-carboxylic acid ethyl ester ETHYL 4-[(4-METHYLPYRIDIN-2-YL)AMINO]PIPERIDINE-1-CARBOXYLATE ethyl 4-(4-methylpyridin-2-ylamino)piperidine-1-carboxylate
TypeSmall organic molecule
Emp. Form.C14H21N3O2
Mol. Mass.263.3354
SMILESCCOC(=O)N1CCC(CC1)Nc1cc(C)ccn1