Reaction Details
TargetPeptidyl-prolyl cis-trans isomerase FKBP1A
LigandBDBM36610
Substrate/Competitorn/a
Meas. Tech.FKBP12 Assay
Ki 3.5±0.0 nM
EC50 10±0.0 nM
Citation Luengo, JIYamashita, DSDunnington, DBeck, AKRozamus, LWYen, HKBossard, MJLevy, MAHand, ANewman-Tarr, T Structure-activity studies of rapamycin analogs: evidence that the C-7 methoxy group is part of the effector domain and positioned at the FKBP12-FRAP interface. Chem Biol2:471-81 (1995) 
 
Peptidyl-prolyl cis-trans isomerase FKBP1A
Name:Peptidyl-prolyl cis-trans isomerase FKBP1A
Type:Isomerase
Mol. Mass.:11953.09
Organism:Homo sapiens (Human)
Description:P62942
Residue:108
BDBM36610
NameBDBM36610
Synonyms:Rapamycin C-7, analog 5a
TypeSmall organic molecule
Emp. Form.C52H81NO13
Mol. Mass.928.1984
SMILESCCO[C@@H]1C[C@@H]2CC[C@@H](C)[C@@](O)(O2)C(=O)C(=O)N2CCCC[C@H]2C(=O)O[C@@H](CC(=O)[C@H](C)\C=C(C)\[C@@H](O)[C@@H](OC)C(=O)[C@H](C)C[C@H](C)\C=C\C=C\C=C1/C)[C@H](C)C[C@@H]1CC[C@@H](O)[C@@H](C1)OC