Reaction Details
TargetPeptidyl-prolyl cis-trans isomerase FKBP1A
LigandBDBM36627
Substrate/Competitorn/a
Meas. Tech.FKBP12 Assay
Ki 1±0.0 nM
EC50 45±0.0 nM
Citation Luengo, JIYamashita, DSDunnington, DBeck, AKRozamus, LWYen, HKBossard, MJLevy, MAHand, ANewman-Tarr, T Structure-activity studies of rapamycin analogs: evidence that the C-7 methoxy group is part of the effector domain and positioned at the FKBP12-FRAP interface. Chem Biol2:471-81 (1995) 
 
Peptidyl-prolyl cis-trans isomerase FKBP1A
Name:Peptidyl-prolyl cis-trans isomerase FKBP1A
Type:Isomerase
Mol. Mass.:11953.09
Organism:Homo sapiens (Human)
Description:P62942
Residue:108
BDBM36627
NameBDBM36627
Synonyms:Rapamycin C-7, analog 16a
TypeSmall organic molecule
Emp. Form.C57H82ClNO13
Mol. Mass.1024.713
SMILESCO[C@@H]1C[C@H](C[C@@H](C)[C@@H]2CC(=O)[C@H](C)\C=C(C)\[C@@H](O)[C@@H](OC)C(=O)[C@H](C)C[C@H](C)\C=C\C=C\C=C(C)\[C@@H](C[C@@H]3CC[C@@H](C)[C@@](O)(O3)C(=O)C(=O)N3CCCC[C@H]3C(=O)O2)OCc2ccc(Cl)cc2)CC[C@H]1O