Reaction Details
TargetHIV-1 protease
LigandBDBM36646
Substrate/Competitorn/a
Meas. Tech.Protease Inhibtion Assay
pH5.5±0
Ki 0.031±0.021 nM
Citation Rodgers, JDLam, PYJohnson, BLWang, HLi, RRu, YKo, SSSeitz, SPTrainor, GLAnderson, PSKlabe, RMBacheler, LTCordova, BGarber, SReid, CWright, MRChang, CHErickson-Viitanen, S Design and selection of DMP 850 and DMP 851: the next generation of cyclic urea HIV protease inhibitors. Chem Biol5:597-608 (1998) 
 
HIV-1 protease
Name:HIV-1 protease
Synonyms:HIV-1 protease wild type
Type:Protein
Mol. Mass.:10757.68
Organism:Human immunodeficiency virus
Description:O90785
Residue:99
BDBM36646
NameBDBM36646
Synonyms:DMP850
TypeSmall organic molecule
Emp. Form.C34H35N5O3
Mol. Mass.561.6734
SMILESNc1n[nH]c2ccc(CN3[C@H](Cc4ccccc4)[C@H](O)[C@@H](O)[C@@H](Cc4ccccc4)N(Cc4ccccc4)C3=O)cc12