Reaction Details
TargetThymidylate synthase
LigandBDBM36671
Substrate/Competitorn/a
Meas. Tech.Enzyme Assay
pH7.4±0
Temperature293.15±0 K
IC50 8.3e+4±n/a nM
Citation Tondi, DSlomczynska, UCosti, MPWatterson, DMGhelli, SShoichet, BK Structure-based discovery and in-parallel optimization of novel competitive inhibitors of thymidylate synthase. Chem Biol6:319-31 (1999) 
 
Thymidylate synthase
Name:Thymidylate synthase
Type:Enzyme
Mol. Mass.:36576.54
Organism:Lactobacillus casei
Description:n/a
Residue:316
BDBM36671
NameBDBM36671
Synonyms:Dansyl derivatives 10A, (R) isomer | Dansyl derivatives 9A, (S) isomer
TypeSmall organic molecule
Emp. Form.C21H23N3O4S
Mol. Mass.413.49
SMILESCN(C)c1cccc2c(cccc12)S(=O)(=O)Oc1ccc(CC(N)C(N)=O)cc1