Reaction Details
TargetThymidylate synthase
LigandBDBM36674
Substrate/Competitorn/a
Meas. Tech.Enzyme Assay
pH7.4±0
Temperature293.15±0 K
IC50 2.53e+5±n/a nM
Citation Tondi, DSlomczynska, UCosti, MPWatterson, DMGhelli, SShoichet, BK Structure-based discovery and in-parallel optimization of novel competitive inhibitors of thymidylate synthase. Chem Biol6:319-31 (1999) 
 
Thymidylate synthase
Name:Thymidylate synthase
Type:Enzyme
Mol. Mass.:36576.54
Organism:Lactobacillus casei
Description:n/a
Residue:316
BDBM36674
NameBDBM36674
Synonyms:Dansyl derivatives 12A, (S) isomer | Dansyl derivatives 13A, (R) isomer
TypeSmall organic molecule
Emp. Form.C23H25N3O5S
Mol. Mass.455.527
SMILESCN(C)c1cccc2c(cccc12)S(=O)(=O)Oc1ccc(CC(NC(C)=O)C(N)=O)cc1