Reaction Details
TargetThymidylate synthase
LigandBDBM36676
Substrate/Competitorn/a
Meas. Tech.Enzyme Assay
pH7.4±0
Temperature293.15±0 K
IC50 7.8e+4±n/a nM
Citation Tondi, DSlomczynska, UCosti, MPWatterson, DMGhelli, SShoichet, BK Structure-based discovery and in-parallel optimization of novel competitive inhibitors of thymidylate synthase. Chem Biol6:319-31 (1999) 
 
Thymidylate synthase
Name:Thymidylate synthase
Type:Enzyme
Mol. Mass.:36576.54
Organism:Lactobacillus casei
Description:n/a
Residue:316
BDBM36676
NameBDBM36676
Synonyms:Dansyl derivatives 14A, (S) isomer
TypeSmall organic molecule
Emp. Form.C26H30N2O7S
Mol. Mass.514.591
SMILESCN(C)c1cccc2c(cccc12)S(=O)(=O)Oc1ccc(CC(NC(=O)OC(C)(C)C)C(O)=O)cc1