Reaction Details
TargetThymidylate synthase
LigandBDBM36679
Substrate/Competitorn/a
Meas. Tech.Enzyme Assay
pH7.4±0
Temperature293.15±0 K
IC50 1.04e+5±n/a nM
Citation Tondi, DSlomczynska, UCosti, MPWatterson, DMGhelli, SShoichet, BK Structure-based discovery and in-parallel optimization of novel competitive inhibitors of thymidylate synthase. Chem Biol6:319-31 (1999) 
 
Thymidylate synthase
Name:Thymidylate synthase
Type:Enzyme
Mol. Mass.:36576.54
Organism:Lactobacillus casei
Description:n/a
Residue:316
BDBM36679
NameBDBM36679
Synonyms:Dansyl derivatives 17A, (S) isomer
TypeSmall organic molecule
Emp. Form.C23H25N3O6S
Mol. Mass.471.526
SMILESCN(C)c1cccc2c(cccc12)S(=O)(=O)Oc1ccc(CC(N)C(=O)NCC(O)=O)cc1