Reaction Details
TargetThymidylate synthase
LigandBDBM36688
Substrate/Competitorn/a
Meas. Tech.Enzyme Assay
pH7.4±0
Temperature293.15±0 K
IC50 1.67e+4±n/a nM
Citation Tondi, DSlomczynska, UCosti, MPWatterson, DMGhelli, SShoichet, BK Structure-based discovery and in-parallel optimization of novel competitive inhibitors of thymidylate synthase. Chem Biol6:319-31 (1999) 
 
Thymidylate synthase
Name:Thymidylate synthase
Type:Enzyme
Mol. Mass.:36576.54
Organism:Lactobacillus casei
Description:n/a
Residue:316
BDBM36688
NameBDBM36688
Synonyms:Dansyltyrosine deriviative 5B
TypeSmall organic molecule
Emp. Form.C30H27N3O7S3
Mol. Mass.637.746
SMILESCN(C)c1cccc2c(cccc12)S(=O)(=O)Oc1ccc(C[C@H](NS(=O)(=O)c2ccc(s2)-c2ccccn2)C(O)=O)cc1