Reaction Details
TargetThymidylate synthase
LigandBDBM36692
Substrate/Competitorn/a
Meas. Tech.Enzyme Assay
pH7.4±0
Temperature293.15±0 K
IC50 2.56e+5±n/a nM
Citation Tondi, DSlomczynska, UCosti, MPWatterson, DMGhelli, SShoichet, BK Structure-based discovery and in-parallel optimization of novel competitive inhibitors of thymidylate synthase. Chem Biol6:319-31 (1999) 
 
Thymidylate synthase
Name:Thymidylate synthase
Type:Enzyme
Mol. Mass.:36576.54
Organism:Lactobacillus casei
Description:n/a
Residue:316
BDBM36692
NameBDBM36692
Synonyms:Dansyltyrosine deriviative 9B
TypeSmall organic molecule
Emp. Form.C27H28N4O8S3
Mol. Mass.632.728
SMILESCN(C)c1cccc2c(cccc12)S(=O)(=O)Oc1ccc(C[C@H](NS(=O)(=O)c2sc(NC(C)=O)nc2C)C(O)=O)cc1