Reaction Details
TargetThymidylate synthase
LigandBDBM36696
Substrate/Competitorn/a
Meas. Tech.Enzyme Assay
pH7.4±0
Temperature293.15±0 K
IC50 2.7e+4±n/a nM
Citation Tondi, DSlomczynska, UCosti, MPWatterson, DMGhelli, SShoichet, BK Structure-based discovery and in-parallel optimization of novel competitive inhibitors of thymidylate synthase. Chem Biol6:319-31 (1999) 
 
Thymidylate synthase
Name:Thymidylate synthase
Type:Enzyme
Mol. Mass.:36576.54
Organism:Lactobacillus casei
Description:n/a
Residue:316
BDBM36696
NameBDBM36696
Synonyms:Dansyl derivative, 5L | Dansyltyrosine deriviative 13B
TypeSmall organic molecule
Emp. Form.C28H24F3N3O9S2
Mol. Mass.667.63
SMILESCN(C)c1cccc2c(cccc12)S(=O)(=O)Oc1ccc(C[C@H](NS(=O)(=O)c2ccc(cc2N(=O)=O)C(F)(F)F)C(O)=O)cc1