Reaction Details
TargetThymidylate synthase
LigandBDBM36703
Substrate/Competitorn/a
Meas. Tech.Enzyme Assay
pH7.4±0
Temperature293.15±0 K
IC50 7.0e+4±n/a nM
Citation Tondi, DSlomczynska, UCosti, MPWatterson, DMGhelli, SShoichet, BK Structure-based discovery and in-parallel optimization of novel competitive inhibitors of thymidylate synthase. Chem Biol6:319-31 (1999) 
 
Thymidylate synthase
Name:Thymidylate synthase
Type:Enzyme
Mol. Mass.:36576.54
Organism:Lactobacillus casei
Description:n/a
Residue:316
BDBM36703
NameBDBM36703
Synonyms:Dansyl derivative, 7L | Dansyltyrosine deriviative 22B
TypeSmall organic molecule
Emp. Form.C32H28N2O6S
Mol. Mass.568.64
SMILESCN(C)c1cccc2c(cccc12)S(=O)(=O)Oc1ccc(C[C@H](NC(=O)c2ccc3ccccc3c2)C(O)=O)cc1