Reaction Details
TargetThymidylate synthase
LigandBDBM36711
Substrate/Competitorn/a
Meas. Tech.Enzyme Assay
pH7.4±0
Temperature293.15±0 K
IC50 1.1e+4±n/a nM
Citation Tondi, DSlomczynska, UCosti, MPWatterson, DMGhelli, SShoichet, BK Structure-based discovery and in-parallel optimization of novel competitive inhibitors of thymidylate synthase. Chem Biol6:319-31 (1999) 
 
Thymidylate synthase
Name:Thymidylate synthase
Type:Enzyme
Mol. Mass.:36576.54
Organism:Lactobacillus casei
Description:n/a
Residue:316
BDBM36711
NameBDBM36711
Synonyms:Dansyltyrosine deriviative 30B
TypeSmall organic molecule
Emp. Form.C31H27ClN2O7S2
Mol. Mass.639.138
SMILESCN(C)c1cccc2c(cccc12)S(=O)(=O)Oc1ccc(C[C@H](NS(=O)(=O)c2cccc3c(Cl)cccc23)C(O)=O)cc1