Reaction Details
TargetThymidylate synthase
LigandBDBM36714
Substrate/Competitorn/a
Meas. Tech.Enzyme Assay
pH7.4±0
Temperature293.15±0 K
IC50 9.0e+4±n/a nM
Citation Tondi, DSlomczynska, UCosti, MPWatterson, DMGhelli, SShoichet, BK Structure-based discovery and in-parallel optimization of novel competitive inhibitors of thymidylate synthase. Chem Biol6:319-31 (1999) 
 
Thymidylate synthase
Name:Thymidylate synthase
Type:Enzyme
Mol. Mass.:36576.54
Organism:Lactobacillus casei
Description:n/a
Residue:316
BDBM36714
NameBDBM36714
Synonyms:Dansyltyrosine deriviative 34B
TypeSmall organic molecule
Emp. Form.C23H23F3N2O7S2
Mol. Mass.560.563
SMILESCN(C)c1cccc2c(cccc12)S(=O)(=O)Oc1ccc(C[C@H](NS(=O)(=O)CC(F)(F)F)C(O)=O)cc1