Reaction Details
TargetBeta-lactamase
LigandBDBM39810
Substrate/Competitorn/a
Meas. Tech.Enzyme Inhibition Assay
pH7±0
Ki 7.0e+2±n/a nM
Citation Caselli, EPowers, RABlasczcak, LCWu, CYPrati, FShoichet, BK Energetic, structural, and antimicrobial analyses of beta-lactam side chain recognition by beta-lactamases. Chem Biol8:17-31 (2001) 
 
Beta-lactamase
Name:Beta-lactamase
Type:Protien
Mol. Mass.:41561.62
Organism:Escherichia coli
Description:P00811
Residue:377
BDBM39810
NameBDBM39810
Synonyms:Acylglycineboronic acid, 7
TypeSmall organic molecule
Emp. Form.C9H12BNO4
Mol. Mass.209.007
SMILESOB(O)CNC(=O)COc1ccccc1