Reaction Details
TargetBeta-lactamase
LigandBDBM50115621
Substrate/Competitorn/a
Meas. Tech.Enzyme Inhibition Assay
pH7±0
Ki 6.5e+3±n/a nM
Citation Caselli, EPowers, RABlasczcak, LCWu, CYPrati, FShoichet, BK Energetic, structural, and antimicrobial analyses of beta-lactam side chain recognition by beta-lactamases. Chem Biol8:17-31 (2001) 
 
Beta-lactamase
Name:Beta-lactamase
Type:PROTEIN
Mol. Mass.:31367.53
Organism:Staphylococcus aureus
Description:ChEMBL_41052
Residue:281
BDBM50115621
NameBDBM50115621
Synonyms:(2-(thiophen-2-yl)acetamido)methylboronic acid CHEMBL320049 N-dihydroxyBoranylmethyl-2-thiophen-2-yl-acetamide
TypeSmall organic molecule
Emp. Form.C7H10BNO3S
Mol. Mass.199.035
SMILESOB(O)CNC(=O)Cc1cccs1