Reaction Details
TargetTyrosine-protein kinase BTK
LigandBDBM267491
Substrate/Competitorn/a
Meas. Tech.Btk Enzyme Activity Assay A
pH7.2±n/a
Temperature298.15±n/a K
EC50<10.00±n/a nM
Commentsextracted
Citation De Man, APSterrenburg, JRaaijmakers, HCKaptein, AOubrie, AARewinkel, JBJans, CGWijkmans, JCBarf, TACooper, ABKim, RMBoga, SBZhu, HYGao, XYao, XAnand, RWu, HLiu, SYang, CAlhassan, AWang, JYu, YLiu, JVaccaro, HM BTK Inhibitors US Patent US9718828 Publication Date 8/1/2017
 
Tyrosine-protein kinase BTK
Name:Tyrosine-protein kinase BTK
Type:Enzyme
Mol. Mass.:76289.95
Organism:Homo sapiens (Human)
Description:Q06187
Residue:659
BDBM267491
NameBDBM267491
Synonyms:4-(8-amino-3-((trans)-4-hydroxycyclohexyl)imidazo[1,5-a]pyrazin-1-yl)-N-(5-methyl-4,5,6,7-tetrahydrothiazolo[5,4-c]pyridin-2-yl)benzamide | US9718828, Example, 19
TypeSmall organic molecule
Emp. Form.C26H28N6O2
Mol. Mass.456.5395
SMILESCCc1ccnc(NC(=O)c2ccc(cc2)-c2nc([C@H]3CC[C@H](O)CC3)n3ccnc(N)c23)c1