Reaction Details
TargetTyrosine-protein kinase BTK
LigandBDBM267502
Substrate/Competitorn/a
Meas. Tech.Btk Enzyme Activity Assay A
pH7.2±n/a
Temperature298.15±n/a K
EC50<10.00±n/a nM
Commentsextracted
Citation De Man, APSterrenburg, JRaaijmakers, HCKaptein, AOubrie, AARewinkel, JBJans, CGWijkmans, JCBarf, TACooper, ABKim, RMBoga, SBZhu, HYGao, XYao, XAnand, RWu, HLiu, SYang, CAlhassan, AWang, JYu, YLiu, JVaccaro, HM BTK Inhibitors US Patent US9718828 Publication Date 8/1/2017
 
Tyrosine-protein kinase BTK
Name:Tyrosine-protein kinase BTK
Type:Enzyme
Mol. Mass.:76289.95
Organism:Homo sapiens (Human)
Description:Q06187
Residue:659
BDBM267502
NameBDBM267502
Synonyms:4-(8-amino-3-((1R,5S,6S)-3-oxabicyc1o[3.1.0]hexan-6-yl)imidazo[1,5-a]pyrazin-1-yl)-N-(4-propylpyridin-2-yl)benzamide | US9718828, Example, 31
TypeSmall organic molecule
Emp. Form.C24H19F3N6O2
Mol. Mass.480.4419
SMILESNc1nccn2c(nc(-c3ccc(cc3)C(=O)Nc3cc(ccn3)C(F)(F)F)c12)[C@@H]1[C@H]2COC[C@@H]12