Reaction Details
TargetTyrosine-protein kinase BTK
LigandBDBM267511
Substrate/Competitorn/a
Meas. Tech.Btk Enzyme Activity Assay A
pH7.2±n/a
Temperature298.15±n/a K
EC50<10.00±n/a nM
Commentsextracted
Citation De Man, APSterrenburg, JRaaijmakers, HCKaptein, AOubrie, AARewinkel, JBJans, CGWijkmans, JCBarf, TACooper, ABKim, RMBoga, SBZhu, HYGao, XYao, XAnand, RWu, HLiu, SYang, CAlhassan, AWang, JYu, YLiu, JVaccaro, HM BTK Inhibitors US Patent US9718828 Publication Date 8/1/2017
 
Tyrosine-protein kinase BTK
Name:Tyrosine-protein kinase BTK
Type:Enzyme
Mol. Mass.:76289.95
Organism:Homo sapiens (Human)
Description:Q06187
Residue:659
BDBM267511
NameBDBM267511
Synonyms:4-(8-amino-3-((cis)-4-methoxycyclohexyl)imidazo [1,5-a]pyrazin-1-yl)-N-(5-ethylthiazol-2-yl)benzamide | US9718828, Example, 40
TypeSmall organic molecule
Emp. Form.C26H25F3N6O2
Mol. Mass.510.5109
SMILESCO[C@H]1CC[C@H](CC1)c1nc(-c2ccc(cc2)C(=O)Nc2cc(ccn2)C(F)(F)F)c2c(N)nccn12