Reaction Details
TargetTyrosine-protein kinase BTK
LigandBDBM267517
Substrate/Competitorn/a
Meas. Tech.Btk Enzyme Activity Assay A
pH7.2±n/a
Temperature298.15±n/a K
EC50<10.00±n/a nM
Commentsextracted
Citation De Man, APSterrenburg, JRaaijmakers, HCKaptein, AOubrie, AARewinkel, JBJans, CGWijkmans, JCBarf, TACooper, ABKim, RMBoga, SBZhu, HYGao, XYao, XAnand, RWu, HLiu, SYang, CAlhassan, AWang, JYu, YLiu, JVaccaro, HM BTK Inhibitors US Patent US9718828 Publication Date 8/1/2017
 
Tyrosine-protein kinase BTK
Name:Tyrosine-protein kinase BTK
Type:Enzyme
Mol. Mass.:76289.95
Organism:Homo sapiens (Human)
Description:Q06187
Residue:659
BDBM267517
NameBDBM267517
Synonyms:(R)-4-(8-amino-3-(1-propionylpiperidin-3-yl) imidazo[1,5-a]pyrazin-1-yl)-N-(pyridin-2-yl)benzamide | US9718828, Example, 47
TypeSmall organic molecule
Emp. Form.C26H27N7O3
Mol. Mass.485.5377
SMILESCCOC(=O)N1CCC[C@H](C1)c1nc(-c2ccc(cc2)C(=O)Nc2ccccn2)c2c(N)nccn12