Reaction Details
TargetTyrosine-protein kinase BTK
LigandBDBM267549
Substrate/Competitorn/a
Meas. Tech.Btk Enzyme Activity Assay A
pH7.2±n/a
Temperature298.15±n/a K
EC50<10.00±n/a nM
Commentsextracted
Citation De Man, APSterrenburg, JRaaijmakers, HCKaptein, AOubrie, AARewinkel, JBJans, CGWijkmans, JCBarf, TACooper, ABKim, RMBoga, SBZhu, HYGao, XYao, XAnand, RWu, HLiu, SYang, CAlhassan, AWang, JYu, YLiu, JVaccaro, HM BTK Inhibitors US Patent US9718828 Publication Date 8/1/2017
 
Tyrosine-protein kinase BTK
Name:Tyrosine-protein kinase BTK
Type:Enzyme
Mol. Mass.:76289.95
Organism:Homo sapiens (Human)
Description:Q06187
Residue:659
BDBM267549
NameBDBM267549
Synonyms:(R)-4-(8-amino-3-(1-phenethylpiperidin-3-yl)imidazo[1,5-a]pyrazin-1-yl)-N-(pyridin-2-yl)benzamide | US9718828, Example, 135
TypeSmall organic molecule
Emp. Form.C28H29N9O
Mol. Mass.507.5896
SMILESCn1cc(CN2CCC[C@H](C2)c2nc(-c3ccc(cc3)C(=O)Nc3ccccn3)c3c(N)nccn23)cn1