Reaction Details
TargetTyrosine-protein kinase BTK
LigandBDBM267555
Substrate/Competitorn/a
Meas. Tech.Btk Enzyme Activity Assay A
pH7.2±n/a
Temperature298.15±n/a K
EC50<10.00±n/a nM
Commentsextracted
Citation De Man, APSterrenburg, JRaaijmakers, HCKaptein, AOubrie, AARewinkel, JBJans, CGWijkmans, JCBarf, TACooper, ABKim, RMBoga, SBZhu, HYGao, XYao, XAnand, RWu, HLiu, SYang, CAlhassan, AWang, JYu, YLiu, JVaccaro, HM BTK Inhibitors US Patent US9718828 Publication Date 8/1/2017
 
Tyrosine-protein kinase BTK
Name:Tyrosine-protein kinase BTK
Type:Enzyme
Mol. Mass.:76289.95
Organism:Homo sapiens (Human)
Description:Q06187
Residue:659
BDBM267555
NameBDBM267555
Synonyms:(R)-4-(8-amino-3-(1-(cyclopropylmethyl)piperidin-3-yl)imidazo[1,5-a]pyrazin-1-yl)-N-(4-(trifluoromethyl)pyridin-2-yl)benzamide | US9718828, Example, 141
TypeSmall organic molecule
Emp. Form.C30H27F3N8O
Mol. Mass.572.5836
SMILESNc1nccn2c(nc(-c3ccc(cc3)C(=O)Nc3cc(ccn3)C(F)(F)F)c12)[C@@H]1CCCN(Cc2ccncc2)C1