Reaction Details
TargetTyrosine-protein kinase BTK
LigandBDBM267891
Substrate/Competitorn/a
Meas. Tech.Btk Enzyme Activity Assay C
IC50<10.00±n/a nM
Citation De Man, APSterrenburg, JRaaijmakers, HCKaptein, AOubrie, AARewinkel, JBJans, CGWijkmans, JCBarf, TACooper, ABKim, RMBoga, SBZhu, HYGao, XYao, XAnand, RWu, HLiu, SYang, CAlhassan, AWang, JYu, YLiu, JVaccaro, HM BTK Inhibitors US Patent US9718828 Publication Date 8/1/2017
 
Tyrosine-protein kinase BTK
Name:Tyrosine-protein kinase BTK
Type:Enzyme
Mol. Mass.:76289.95
Organism:Homo sapiens (Human)
Description:Q06187
Residue:659
BDBM267891
NameBDBM267891
Synonyms:4-(8-amino-5-methyl-3-{(2R)-4-[(3-methyloxetan-3-yl)carbonyl]morpholin-2-yl}imidazo[1,5-a]pyrazin-1-yl)-N-[4-(trifluoromethyl)pyridin-2-yl]benzamide | US9718828, Example, 507
TypeSmall organic molecule
Emp. Form.C28H28F3N7O3
Mol. Mass.567.5622
SMILESCC1(CN2CCO[C@H](C2)c2nc(-c3ccc(cc3)C(=O)Nc3cc(ccn3)C(F)(F)F)c3c(N)nccn23)COC1