Reaction Details
TargetTyrosine-protein kinase BTK
LigandBDBM267892
Substrate/Competitorn/a
Meas. Tech.Btk Enzyme Activity Assay C
IC50<10.00±n/a nM
Citation De Man, APSterrenburg, JRaaijmakers, HCKaptein, AOubrie, AARewinkel, JBJans, CGWijkmans, JCBarf, TACooper, ABKim, RMBoga, SBZhu, HYGao, XYao, XAnand, RWu, HLiu, SYang, CAlhassan, AWang, JYu, YLiu, JVaccaro, HM BTK Inhibitors US Patent US9718828 Publication Date 8/1/2017
 
Tyrosine-protein kinase BTK
Name:Tyrosine-protein kinase BTK
Type:Enzyme
Mol. Mass.:76289.95
Organism:Homo sapiens (Human)
Description:Q06187
Residue:659
BDBM267892
NameBDBM267892
Synonyms:4-(8-amino-3-{(2R)-4-[(3-methyloxetan-3-yl)methyl]morpholin-2-yl}imidazo[1,5-a]pyrazin-1-yl)-N-[4-(trifluoromethyl)pyridin-2-yl]benzamide | US9718828, Example, 508
TypeSmall organic molecule
Emp. Form.C27H26F3N7O2
Mol. Mass.537.5362
SMILESNc1nccn2c(nc(-c3ccc(cc3)C(=O)Nc3cc(ccn3)C(F)(F)F)c12)[C@H]1CN(CC2CC2)CCO1