Reaction Details
TargetTyrosine-protein kinase BTK
LigandBDBM267893
Substrate/Competitorn/a
Meas. Tech.Btk Enzyme Activity Assay C
IC50<10.00±n/a nM
Citation De Man, APSterrenburg, JRaaijmakers, HCKaptein, AOubrie, AARewinkel, JBJans, CGWijkmans, JCBarf, TACooper, ABKim, RMBoga, SBZhu, HYGao, XYao, XAnand, RWu, HLiu, SYang, CAlhassan, AWang, JYu, YLiu, JVaccaro, HM BTK Inhibitors US Patent US9718828 Publication Date 8/1/2017
 
Tyrosine-protein kinase BTK
Name:Tyrosine-protein kinase BTK
Type:Enzyme
Mol. Mass.:76289.95
Organism:Homo sapiens (Human)
Description:Q06187
Residue:659
BDBM267893
NameBDBM267893
Synonyms:4-{8-amino-3-[(2R)-4-(cyclopropylmethyl)morpholin-2-yl]imidazo[1,5-a]pyrazin-1-yl}-N-[4-(trifluoromethyl)pyridin-2-yl]benzamide | US9718828, Example, 509
TypeSmall organic molecule
Emp. Form.C29H28F3N9O2
Mol. Mass.591.5869
SMILESCc1cnc(N)c2c(nc([C@H]3CN(Cc4cnn(C)c4)CCO3)n12)-c1ccc(cc1)C(=O)Nc1cc(ccn1)C(F)(F)F