Reaction Details
TargetTyrosine-protein kinase BTK
LigandBDBM267899
Substrate/Competitorn/a
Meas. Tech.Btk Enzyme Activity Assay C
IC50<10.00±n/a nM
Citation De Man, APSterrenburg, JRaaijmakers, HCKaptein, AOubrie, AARewinkel, JBJans, CGWijkmans, JCBarf, TACooper, ABKim, RMBoga, SBZhu, HYGao, XYao, XAnand, RWu, HLiu, SYang, CAlhassan, AWang, JYu, YLiu, JVaccaro, HM BTK Inhibitors US Patent US9718828 Publication Date 8/1/2017
 
Tyrosine-protein kinase BTK
Name:Tyrosine-protein kinase BTK
Type:Enzyme
Mol. Mass.:76289.95
Organism:Homo sapiens (Human)
Description:Q06187
Residue:659
BDBM267899
NameBDBM267899
Synonyms:4-(8-amino-5-methyl-3-{(2R)-4-[(3-methyloxetan-3-yl)carbonyl]morpholin-2-yl}imidazo[1,5-a]pyrazin-1-yl)-3-fluoro-N-[4-(trifluoromethyl)pyridin-2-yl]benzamide | US9718828, Example, 515
TypeSmall organic molecule
Emp. Form.C29H28F3N7O4
Mol. Mass.595.5723
SMILESC[C@H]1CO[C@H](CN1C(=O)C1(C)COC1)c1nc(-c2ccc(cc2)C(=O)Nc2cc(ccn2)C(F)(F)F)c2c(N)nccn12