Reaction Details
TargetTyrosine-protein kinase BTK
LigandBDBM267903
Substrate/Competitorn/a
Meas. Tech.Btk Enzyme Activity Assay C
IC50<10.00±n/a nM
Citation De Man, APSterrenburg, JRaaijmakers, HCKaptein, AOubrie, AARewinkel, JBJans, CGWijkmans, JCBarf, TACooper, ABKim, RMBoga, SBZhu, HYGao, XYao, XAnand, RWu, HLiu, SYang, CAlhassan, AWang, JYu, YLiu, JVaccaro, HM BTK Inhibitors US Patent US9718828 Publication Date 8/1/2017
 
Tyrosine-protein kinase BTK
Name:Tyrosine-protein kinase BTK
Type:Enzyme
Mol. Mass.:76289.95
Organism:Homo sapiens (Human)
Description:Q06187
Residue:659
BDBM267903
NameBDBM267903
Synonyms:4-{8-amino-3-[(2R)-4-(ethoxyacetyl)morpholin-2-yl]imidazo[1,5-a]pyrazin-1-yl}-N-[4-(trifluoromethyl)pyridin-2-yl]benzamide | US9718828, Example, 519
TypeSmall organic molecule
Emp. Form.C26H24F3N7O4
Mol. Mass.555.5085
SMILESC[C@H](O)C(=O)N1CCO[C@H](C1)c1nc(-c2ccc(cc2)C(=O)Nc2cc(ccn2)C(F)(F)F)c2c(N)nccn12