Reaction Details
TargetQuinone-dependent D-lactate dehydrogenase
LigandBDBM59098
Substrate/Competitorn/a
Meas. Tech.Steady-State Inhibition Assay
pH7.4±0
Ki 5.5e+4±n/a nM
Citation Sem, DSBertolaet, BBaker, BChang, ECostache, ADCoutts, SDong, QHansen, MHong, VHuang, XJack, RMKho, RLang, HMa, CTMeininger, DPellecchia, MPierre, FVillar, HYu, L Systems-based design of bi-ligand inhibitors of oxidoreductases: filling the chemical proteomic toolbox. Chem Biol11:185-94 (2004) 
 
Quinone-dependent D-lactate dehydrogenase
Name:Quinone-dependent D-lactate dehydrogenase
Type:Enzyme
Mol. Mass.:64613.58
Organism:Escherichia coli
Description:P06149
Residue:571
BDBM59098
NameBDBM59098
Synonyms:Bi-ligand, 1
TypeSmall organic molecule
Emp. Form.C12H8NO5S2
Mol. Mass.310.326
SMILESOc1ccc(\C=C2/SC(=S)N(CC([O-])=O)C2=O)cc1O