Reaction Details
Target4-hydroxy-tetrahydrodipicolinate reductase
LigandBDBM59101
Substrate/Competitorn/a
Meas. Tech.Steady-State Inhibition Assay
pH7.4±0
Ki 100±0.0 nM
Citation Sem, DSBertolaet, BBaker, BChang, ECostache, ADCoutts, SDong, QHansen, MHong, VHuang, XJack, RMKho, RLang, HMa, CTMeininger, DPellecchia, MPierre, FVillar, HYu, L Systems-based design of bi-ligand inhibitors of oxidoreductases: filling the chemical proteomic toolbox. Chem Biol11:185-94 (2004) 
 
4-hydroxy-tetrahydrodipicolinate reductase
Name:4-hydroxy-tetrahydrodipicolinate reductase
Type:Enzyme
Mol. Mass.:28751.25
Organism:Escherichia coli
Description:P04036
Residue:273
BDBM59101
NameBDBM59101
Synonyms:Bi-ligand, 4
TypeSmall organic molecule
Emp. Form.C21H15N3O8S3
Mol. Mass.533.555
SMILESOc1ccc(\C=C2/SC(=S)N(CC(=O)NCCSc3cc(nc(c3)C([O-])=O)C([O-])=O)C2=O)cc1O