Reaction Details
TargetCoagulation factor VIII
LigandBDBM59152
Substrate/Competitorn/a
Meas. Tech.Inhibition Assay
Temperature310.15±0 K
IC50 2.77e+4± 5.4e+3 nM
Citation Spiegel, PCKaiser, SMSimon, JAStoddard, BL Disruption of protein-membrane binding and identification of small-molecule inhibitors of coagulation factor VIII. Chem Biol11:1413-22 (2004) 
 
Coagulation factor VIII
Name:Coagulation factor VIII
Type:Protein
Mol. Mass.:267036.98
Organism:Homo sapiens (Human)
Description:P00451
Residue:2351
BDBM59152
NameBDBM59152
Synonyms:5523453
TypeSmall organic molecule
Emp. Form.C20H22N2O3S2
Mol. Mass.402.53
SMILESCCOC(=O)c1c(NC(=S)NC(=O)c2ccccc2)sc2CC(C)CCc12