Reaction Details
TargetCapsid scaffolding protein
LigandBDBM59219
Substrate/Competitorn/a
Meas. Tech.Zhang-Poorman Assay
pH5.52±0
Ki 720± 135 nM
IC50 2.7e+3± 2e+2 nM
Citation Bowman, MJByrne, SChmielewski, J Switching between allosteric and dimerization inhibition of HIV-1 protease. Chem Biol12:439-44 (2005) 
 
Capsid scaffolding protein
Name:Capsid scaffolding protein
Type:PROTEIN
Mol. Mass.:66472.05
Organism:Human herpesvirus 1 (strain 17) (HHV-1) (Human herpes simplex virus1)
Description:ChEMBL_158648
Residue:635
BDBM59219
NameBDBM59219
Synonyms:Pepstatin analog, 7
TypeSmall organic molecule
Emp. Form.C48H74N6O10
Mol. Mass.895.1354
SMILESCOc1ccc(CCNC(=O)[C@@H](CC(C)C)NC(=O)[C@H](NC(=O)CCCCCCCCCCCCCCC(=O)N[C@H](CC(N)=O)C(=O)N[C@@H](Cc2ccccc2)C(O)=O)C(C)O)cc1