Reaction Details
TargetCapsid scaffolding protein
LigandBDBM59224
Substrate/Competitorn/a
Meas. Tech.Zhang-Poorman Assay
pH5.52±0
Ki 96±10 nM
IC50 3.6e+2± 3e+1 nM
Citation Bowman, MJByrne, SChmielewski, J Switching between allosteric and dimerization inhibition of HIV-1 protease. Chem Biol12:439-44 (2005) 
 
Capsid scaffolding protein
Name:Capsid scaffolding protein
Type:PROTEIN
Mol. Mass.:66472.05
Organism:Human herpesvirus 1 (strain 17) (HHV-1) (Human herpes simplex virus1)
Description:ChEMBL_158648
Residue:635
BDBM59224
NameBDBM59224
Synonyms:Pepstatin analog, 12
TypePeptide
Emp. Form.C53H76N6O11
Mol. Mass.973.2041
SMILESCC(C)C[C@@H](NC(=O)[C@H](NC(=O)CCCCCCCCCCCCCCC(=O)N[C@H](CC(N)=O)C(=O)N[C@@H](Cc1ccccc1)C(O)=O)C(C)O)C(=O)NCCc1ccc(Oc2ccc(O)cc2)cc1